{"text_format":"1","workbook":"xlsx","n_sheets":11,"sheets":["Start","Bases techniques","Résultats thermiques","Résultats frigorifiques","Instructions","Matériaux isolation","Autres valeurs","Calcul amortissement","Langue","History","Tabelle1"],"not_rendered":{"charts":7,"images":0,"macros":1,"external_links":0,"defined_names":366,"comments":1,"pivot_tables":0},"unopened":[],"bounds":{"document_bytes":16777216,"sheet_cells":100000,"rows_first":2000,"rows_last":500,"rows_between":2000,"halvings":0,"cell_chars":16384,"cell_head_chars":4096},"cells_cut":0,"cells_raw":0,"read":"whole","date_system":"1900"}

{"sheet":"Start","index":0,"n_rows":37,"n_cols":14,"rows_kept":37,"cut":false,"hidden":false,"merged":[[6,4,9,11],[27,4,32,13],[10,4,11,11]]}
[]
[null,"proPIR",null,null,{"$f":"Langue!F27","v":"Outil de calcul PIR-RT2"}]
[null,null,null,null,{"$f":"Langue!F28","v":"pour isolation de conduites dans le domaine thermique ou frigorifique"}]
[null,null,null,null,null,null,null,null,null,null,null,null,null,{"$f":"IF(N14=\"\",\"Objektname\",N14)","v":"Objektname"}]
[null,null,null,null,null,null,null,null,null,null,null,null,null,{"$f":"IF(N16=\"\",\"Objektort\",N16)","v":"Objektort"}]
[null,{"$f":"Langue!F320","v":"Elri AG\n"},null,null,null,null,null,null,null,null,null,null,null,{"$f":"VLOOKUP(Langue!D8,Langue!C3:D4,2,)","v":"Français"}]
[null,{"$f":"Langue!F321","v":"Gewerbestrasse 3"},null,null,{"$f":"Langue!F33","v":"Cet outil excel sert à calculer l'isolation de conduites et estimer les économies de coûts/énergie/CO₂ entre une isolation PIR et une isolation quelconque (variante 2). En ce qui concerne la technique de chauffage, cet outil calcule en outre la temperature de surface des conduites et donc les mesures de protection thermique ou frigorifique. L'eau de condensation et par conséquence, la protection contre l'humidité, est également estimée."}]
[null,{"$f":"Langue!F322","v":"CH-4552 Derendingen"}]
[null,{"$f":"Langue!F323","v":"Tel: +041 (0)32 681 33 11"}]
[null,{"$f":"Langue!F324","v":"Fax: +041(0)32 682 15 05"}]
[null,{"$f":"Langue!F325","v":"www.elri.ch"},null,null,{"$f":"Langue!F34","v":"Ces calculs se limitent aux fluides et sont définis dans des des codes makros."}]
[]
[null,{"$f":"Langue!F327","v":"Regisol AG"}]
[null,{"$f":"Langue!F328","v":"Schwalbenweg 3"},null,null,{"$f":"Langue!F25","v":"Client"},{"$f":"Langue!F19","v":"Entreprise"},null,null,null,{"$f":"Langue!F14","v":"Objet"},null,{"$f":"Langue!F15","v":"Nom"}]
[null,{"$f":"Langue!F329","v":"CH-3292 Busswil bei Büren"},null,null,null,{"$f":"Langue!F20","v":"Responsable du dossier"},null,null,null,null,null,{"$f":"Langue!F16","v":"Rue"}]
{"$rows_left_out":23}
{"sheet":"Bases techniques","index":1,"n_rows":62,"n_cols":20,"rows_kept":62,"cut":false,"hidden":false,"merged":[[43,15,46,15],[11,14,14,14],[9,14,9,15],[10,14,10,15],[6,14,6,15],[7,14,7,15],[17,14,20,16]]}
[]
[null,"proPIR",null,null,{"$f":"Start!E2","v":"Outil de calcul PIR-RT2"}]
[null,null,null,null,{"$f":"Langue!F36","v":"Données de base pour le calcul"}]
[null,null,null,null,null,null,null,null,null,null,null,null,{"$f":"Start!N4","v":"Objektname"}]
[null,null,null,null,null,null,null,null,null,null,null,null,{"$f":"Start!N5","v":"Objektort"}]
[null,{"$f":"Langue!F320","v":"Elri AG\n"}]
[null,{"$f":"Langue!F321","v":"Gewerbestrasse 3"},null,null,{"$f":"Langue!F103","v":"Les valeurs définies sont des valeurs moyennes de différents produits du même type de matériau."},null,null,null,null,null,null,null,null,null,"V1",null,{"$f":"Langue!F86","v":"PIR"}]
[null,{"$f":"Langue!F322","v":"CH-4552 Derendingen"},null,null,{"$f":"Langue!F104","v":"Pour des zones limites, des valeurs spécifiques attestées peuvent être insérées dans les cellules non protégées."},null,null,null,null,null,null,null,null,null,"V2",null,{"$f":"Langue!F87","v":"Variante 2"}]
[null,{"$f":"Langue!F323","v":"Tel: +041 (0)32 681 33 11"},null,null,null,null,null,null,null,null,null,null,null,null,"V1","V2",{"$f":"Langue!F85","v":"Valeurs communes"}]
[null,{"$f":"Langue!F324","v":"Fax: +041(0)32 682 15 05"},null,null,null,null,null,null,null,{"$f":"Langue!F97","v":"Isolation PIR"},null,{"$f":"Langue!F98","v":"Comparaison"},"Kopieren",null,{"$f":"Langue!F268","v":"Modifiable"},null,{"$f":"Langue!F88","v":"Valeur proposée, "}]
[null,{"$f":"Langue!F325","v":"www.elri.ch"},null,null,null,null,null,null,null,"Variante 1",null,"Variante 2","V1 -> V2",null,{"$f":"Langue!F269","v":"Modifiée"},null,{"$f":"Langue!F89","v":"en partie modifiable"}]
[null,null,null,null,{"$f":"Langue!F38","v":"Conduite"}]
[null,{"$f":"Langue!F327","v":"Regisol AG"},null,null,{"$f":"Langue!F39","v":"Matériau"},null,null,null,null,"Acier",null,{"$f":"FeldRohrMaterial","v":"Acier"},null,null,null,null,null,null,"FeldRohrMaterial",{"$f":"CONCATENATE(S13,\"_V2\")","v":"FeldRohrMaterial_V2"}]
[null,{"$f":"Langue!F328","v":"Schwalbenweg 3"},null,null,{"$f":"Langue!F40","v":"Diffusion de chaleur"},null,null,null,"lR",50,null,{"$f":"FeldLambdaR","v":50},"W/(mK)",null,null,null,null,null,"FeldLambdaR",{"$f":"CONCATENATE(S14,\"_V2\")","v":"FeldLambdaR_V2"}]
[null,{"$f":"Langue!F329","v":"CH-3292 Busswil bei Büren"},null,null,{"$f":"Langue!F41","v":"Epaisseur paroi"},null,null,null,"dR",3,null,{"$f":"FeldDR","v":3},"mm",null,null,null,null,null,"FeldDR","FeldDR_V2"]
{"$rows_left_out":48}
{"sheet":"Résultats thermiques","index":2,"n_rows":55,"n_cols":16,"rows_kept":55,"cut":false,"hidden":false,"merged":[[39,9,39,11],[37,9,37,11],[38,9,38,11]]}
[]
[null,"proPIR",null,null,{"$f":"Start!E2","v":"Outil de calcul PIR-RT2"}]
[null,null,null,null,{"$f":"Langue!F92","v":"Résultats protection thermique"}]
[null,null,null,null,null,null,null,null,null,null,null,null,{"$f":"Start!N4","v":"Objektname"}]
[null,null,null,null,null,null,null,null,null,null,null,null,{"$f":"Start!N5","v":"Objektort"}]
[null,{"$f":"Langue!F320","v":"Elri AG\n"}]
[null,{"$f":"Langue!F321","v":"Gewerbestrasse 3"},null,null,null,null,null,null,null,{"$f":"'Bases techniques'!J10","v":"Isolation PIR"},null,{"$f":"'Bases techniques'!L10","v":"Comparaison"}]
[null,{"$f":"Langue!F322","v":"CH-4552 Derendingen"},null,null,null,null,null,null,null,{"$f":"'Bases techniques'!J11","v":"Variante 1"},null,{"$f":"'Bases techniques'!L11","v":"Variante 2"}]
[null,{"$f":"Langue!F323","v":"Tel: +041 (0)32 681 33 11"},null,null,{"$f":"Langue!F93","v":"Résultats partiels du calcul"}]
[null,{"$f":"Langue!F324","v":"Fax: +041(0)32 682 15 05"},null,null,{"$f":"Langue!F94","v":"Conductibilité thermique à la température moyenne d'isolation 35 °C"},null,null,null,"lB",3.0974999070167542E-2,null,3.6437500268220901E-2,"W/(mK)",null,"RWLambdaB",{"$f":"CONCATENATE(O10,\"_V2\")","v":"RWLambdaB_V2"}]
[null,{"$f":"Langue!F325","v":"www.elri.ch"},null,null,"Wärmeübergang aussen",null,null,null,"hse",8.0198078155517578,null,8.1430578231811523,"W/(m2K)",null,"RWhAussen",{"$f":"CONCATENATE(O11,\"_V2\")","v":"RWhAussen_V2"}]
[null,{"$f":"Langue!F326","v":0},null,null,{"$f":"Langue!F96","v":"Températur de surface"},null,null,null,"qU",14.458364486694336,null,14.824156761169434,"°C",null,"RWOberflächentemp",{"$f":"CONCATENATE(O12,\"_V2\")","v":"RWOberflächentemp_V2"}]
[null,{"$f":"Langue!F325","v":"www.elri.ch"},null,null,{"$f":"IF(OR(FeldLambdaDeklariert<>FeldLambda10,FeldLambdaDeklariert_V2<>FeldLambda10_V2),Langue!F262,\"\")","v":""}]
[]
[null,{"$f":"Langue!F327","v":"Regisol AG"},null,null,{"$f":"Langue!F99","v":"Pertes de chaleur"}]
{"$rows_left_out":41}
{"sheet":"Résultats frigorifiques","index":3,"n_rows":58,"n_cols":17,"rows_kept":58,"cut":false,"hidden":false,"merged":[[42,9,42,11],[43,9,43,11],[44,9,44,11]]}
[]
[null,"proPIR",null,null,{"$f":"Start!E2","v":"Outil de calcul PIR-RT2"}]
[null,null,null,null,{"$f":"Langue!F125","v":"Résultats protection frigorifique"}]
[null,null,null,null,null,null,null,null,null,null,null,null,{"$f":"Start!N4","v":"Objektname"}]
[null,null,null,null,null,null,null,null,null,null,null,null,{"$f":"Start!N5","v":"Objektort"}]
[null,{"$f":"Langue!F320","v":"Elri AG\n"}]
[null,{"$f":"Langue!F321","v":"Gewerbestrasse 3"},null,null,null,null,null,null,null,{"$f":"'Bases techniques'!J10","v":"Isolation PIR"},null,{"$f":"'Bases techniques'!L10","v":"Comparaison"}]
[null,{"$f":"Langue!F322","v":"CH-4552 Derendingen"},null,null,null,null,null,null,null,{"$f":"'Bases techniques'!J11","v":"Variante 1"},null,{"$f":"'Bases techniques'!L11","v":"Variante 2"}]
[null,{"$f":"Langue!F323","v":"Tel: +041 (0)32 681 33 11"},null,null,{"$f":"Langue!F93","v":"Résultats partiels du calcul"}]
[null,{"$f":"Langue!F324","v":"Fax: +041(0)32 682 15 05"},null,null,{"$f":"Langue!F94","v":"Conductibilité thermique à la température moyenne d'isolation 35 °C"},null,null,null,"lB",0,null,0,"W/(mK)",null,null,"RKLambdaB",{"$f":"CONCATENATE(P10,\"_V2\")","v":"RKLambdaB_V2"}]
[null,{"$f":"Langue!F325","v":"www.elri.ch"},null,null,"Wärmeübergang aussen",null,null,null,"hse",0,null,0,"W/(m2K)",null,null,"RKhAussen",{"$f":"CONCATENATE(P11,\"_V2\")","v":"RKhAussen_V2"}]
[null,{"$f":"Langue!F326","v":0},null,null,{"$f":"Langue!F96","v":"Températur de surface"},null,null,null,"qU",0,null,0,"°C",null,null,"RKOberflächentemp","RKOberflächentemp_V2"]
[null,{"$f":"Langue!F325","v":"www.elri.ch"},null,null,{"$f":"IF(OR(FeldLambdaDeklariert<>FeldLambda10,FeldLambdaDeklariert_V2<>FeldLambda10_V2),Langue!F262,\"\")","v":""}]
[]
[null,{"$f":"Langue!F327","v":"Regisol AG"},null,null,{"$f":"Langue!F126","v":"Pertes frigorifique"}]
{"$rows_left_out":44}
{"sheet":"Instructions","index":4,"n_rows":66,"n_cols":11,"rows_kept":66,"cut":false,"hidden":false,"merged":[[59,7,61,10],[24,5,28,10],[5,1,8,1],[11,1,14,1],[7,5,7,10],[9,5,9,10],[17,1,20,1],[11,5,14,10],[15,5,17,10],[18,5,20,10],[30,5,37,10],[45,5,47,10],[39,5,42,10],[57,7,58,10]]}
[]
[null,"proPIR",null,null,{"$f":"Start!E2","v":"Outil de calcul PIR-RT2"}]
[null,{"$f":"Start!B3","v":0},null,null,{"$f":"Langue!F140","v":"Instructions"}]
[null,null,null,null,null,null,null,null,null,null,{"$f":"Start!N4","v":"Objektname"}]
[null,null,null,null,null,null,null,null,null,null,{"$f":"Start!N5","v":"Objektort"}]
[null,"Elri AG\nGewerbestrasse 3\nCH-4552 Derendingen\nTel: +041 (0)32 681 33 11\nFax: +041(0)32 682 15 05"]
[null,null,null,null,{"$f":"Langue!F224","v":"Premiers pas"}]
[null,null,null,null,null,{"$f":"Langue!F229","v":"Sur la feuille \"Start\" vous pouvez indiquer l'adresse de l'objet, du planificateur et du client."}]
[]
[null,"www.elri.ch",null,null,null,{"$f":"Langue!F230","v":"Changez la feuille excel \"Bases techniques\" et insérer les données de base requises."}]
[]
[null,"Regisol AG\nSchwalbenweg 3\nCH-3292 Busswil bei Büren\nTel: +041 (0)32 385 22 33\nFax: +041(0)32 385 22 35",null,null,null,{"$f":"Langue!F233","v":"Lorsque toutes les données nécessaires sont remplies, le calcul s'effectue en appuyant sur le bouton \"calculer\". Selon la différence de température, la température du médium la température ambiante, le résultat s'affiche dans le domaine thermique ou frigorifique."}]
[]
[]
[]
{"$rows_left_out":52}
{"sheet":"Matériaux isolation","index":5,"n_rows":73,"n_cols":104,"rows_kept":73,"cut":false,"hidden":true,"merged":[[172,8,173,8],[172,0,173,0],[172,1,172,7]]}
["Grundlagen für die Berechnungen",null,null,null,null,null,null,{"$f":"VLOOKUP(FeldDämmMaterial,A4:H11,8,)","v":3},{"$f":"VLOOKUP(FeldDämmMaterial,Liste_DämmMaterial,9,)","v":50}]
[null,null,null,null,null,null,null,{"$f":"VLOOKUP(FeldDämmMaterial_V2,A4:I11,8,)","v":1},{"$f":"VLOOKUP(FeldDämmMaterial_V2,Liste_DämmMaterial,9,)","v":1}]
[{"$f":"Langue!F274","v":"Matériaux isolants"},"[W/(mK)]","b [1/K]","max. Temp.","min Temp.","Stärke","Dimensionen","Grenze max. Feuchte-\nzuname in 10 Jahren","Wasserdampfdiffusions-\nwiderstand u","Info-Fenster Kältedämmung","tiefstbekannter Lambda Wert bei","höchstbekannter Lambda Wert bei"]
[{"$f":"Langue!F216","v":"Pas d'isolation"},null,0,1000,-1000,null,null,0,1,"nein",-1000,1000,{"$f":"VLOOKUP(FeldDämmMaterial,Liste_DämmMaterial,11,FALSE)","v":-180},{"$f":"VLOOKUP(FeldDämmMaterial,Liste_DämmMaterial,12,FALSE)","v":130}]
[{"$f":"CONCATENATE(Langue!F217,\" (\",E5,\"°C bis \",D5,\"°C)\")","v":"PIR (-40°C bis 120°C)"},null,2.5999999999999999E-3,120,-40,"Liste_DD_Pir","Liste_DiD_Pir",3,50,"nein",-180,130,{"$f":"VLOOKUP(FeldDämmMaterial_V2,Liste_DämmMaterial,11,FALSE)","v":10},{"$f":"VLOOKUP(FeldDämmMaterial_V2,Liste_DämmMaterial,12,FALSE)","v":350}]
[{"$f":"CONCATENATE(Langue!F218,\" (\",E6,\"°C bis \",D6,\"°C)\")","v":"Laine de roche (12°C bis 750°C)"},null,2.8999999999999998E-3,750,12,"Liste_DD_Rock800","Liste_DiD_Rock800",1,1,"ja",10,350]
[{"$f":"CONCATENATE(Langue!F219,\" (\",E7,\"°C bis \",D7,\"°C)\")","v":"Laine de verre (10°C bis 500°C)"},null,2.8999999999999998E-3,500,10,"Liste_DD_VET","Liste_DiD_VET",1,1,"ja",10,300]
[{"$f":"CONCATENATE(Langue!F220,\" (\",E8,\"°C bis \",D8,\"°C)\")","v":"Caoutchouc synth. (-50°C bis 150°C)"},null,3.3E-3,150,-50,"Liste_DD_Armaflex","Liste_DiD_Armaflex",5,10000,"nein",-50,150]
[{"$f":"CONCATENATE(Langue!F221,\" (\",E9,\"°C bis +\",D9,\"°C)\")","v":"Caoutchouc synth. sans halogen (-50°C bis +105°C)"},null,2.8999999999999998E-3,105,-50,"Liste_DD_Halogenfrei","Liste_DiD_Halogenfrei",5,2000,"nein",-50,150]
[{"$f":"Langue!F247","v":"défini par l'utilisateur v1"},null,null,{"$f":"VLOOKUP(FeldDämmMaterial,Liste_DämmMaterial,4,FALSE)","v":120},{"$f":"VLOOKUP(FeldDämmMaterial,Liste_DämmMaterial,5,FALSE)","v":-40},null,null,{"$f":"VLOOKUP(FeldDämmMaterial,Liste_DämmMaterial,8,)","v":3},{"$f":"VLOOKUP(FeldDämmMaterial,Liste_DämmMaterial,9,)","v":50},{"$f":"VLOOKUP(FeldDämmMaterial_V2,'Matériaux isolation'!A4:J9,10,)","v":"ja"}]
[{"$f":"Langue!F248","v":"défini par l'utilisateur v2"},null,null,{"$f":"VLOOKUP(FeldDämmMaterial_V2,Liste_DämmMaterial,4,FALSE)","v":750},{"$f":"VLOOKUP(FeldDämmMaterial_V2,Liste_DämmMaterial,5,FALSE)","v":12},null,null,{"$f":"VLOOKUP(FeldDämmMaterial_V2,Liste_DämmMaterial,8,)","v":1},{"$f":"VLOOKUP(FeldDämmMaterial_V2,Liste_DämmMaterial,9,)","v":1},null,"PIR","MW","FEF"]
[null,null,null,{"$f":"MIN(D10:D11)","v":120},{"$f":"MAX(E10:E11)","v":12},null,null,null,"Lamda 0",null,null,2.7E-2,3.2000000000000001E-2,3.5999999999999997E-2]
["Dämmstärken in mm",null,null,null,null,null,null,null,"b","Temp.Bereich",null,2.5999999999999999E-3,3.3E-3,2.8999999999999998E-3]
[{"$f":"A5","v":"PIR (-40°C bis 120°C)"},{"$f":"A6","v":"Laine de roche (12°C bis 750°C)"},null,{"$f":"A7","v":"Laine de verre (10°C bis 500°C)"},null,{"$f":"A8","v":"Caoutchouc synth. (-50°C bis 150°C)"},{"$f":"A9","v":"Caoutchouc synth. sans halogen (-50°C bis +105°C)"},null,"Temp","Medium",-180,-170,-160,-150,-140,-130,-120,-110,-100,-90,-80,-70,-60,-50,-40,-30,-20,-10,0,10,20,30,40,50,60,70,80,90,100,110,120,130,140,150,160,170,180,190,200,210,220,230,240,250,260,270,280,290,300,310,320,330,340,350,360,370,380,390,400,410,420,430,440,450,460,470,480,490,500,510,520,530,540,550,560,570,580,590,600,610,620,630,640,650,660,670,680,690,700,710,720,730,740,750]
["mm","mm",null,"mm",null,"mm","mm",null,"l PIR (e bt)",null,null,null,null,null,null,null,null,null,null,null,null,null,2.3100098140017497E-2,2.3708576634855157E-2,2.4333083030372529E-2,2.497403951667556E-2,2.5631879404758019E-2,2.6307047419436232E-2,2.7E-2,2.7711205608782936E-2,2.8441145047860848E-2,2.9190311784092243E-2,2.9959212282720728E-2,3.0748366349764789E-2,3.1558307483426466E-2,3.2389583234756443E-2,3.324275557781943E-2,3.4118401289610002E-2,3.5017112339975835E-2,3.5939496291811875E-2,3.6886176711795955E-2,3.7857793591943655E-2,3.885500378226725E-2,3.9878481434831345E-2,4.0928918459505359E-2,4.2007024991720904E-2,4.3113529872550418E-2,4.4249181141431476E-2,4.541474654186993E-2,4.6611014040463757E-2,4.7838792359598502E-2,4.9098911524174386E-2,5.039222342273475E-2,5.1719602383375196E-2,5.3081945764822593E-2,5.4480174563083836E-2,5.5915234034074154E-2,5.7388094332646161E-2,5.8899751168451427E-2]
{"$rows_left_out":59}
{"sheet":"Autres valeurs","index":6,"n_rows":110,"n_cols":9,"rows_kept":110,"cut":false,"hidden":true,"merged":[]}
["Grundlagen für die Berechnungen"]
[]
[]
["Rohrmaterialen"]
[]
[{"$f":"Langue!F141","v":"Matériaux"},"Lambda W/(mK)",{"$f":"Langue!F147","v":"Epaisseur paroi [mm]"},{"$f":"Langue!F263","v":"Emissivité [-]"},null,null,null,"Lambda","Wandstärke"]
[{"$f":"Langue!F143","v":"Acier"},50,3,0.35]
[{"$f":"Langue!F144","v":"Acier CrNi, acier précieux, inox"},17,1.5,0.35]
[{"$f":"Langue!F145","v":"Cu (Cuivre)"},380,1.5,0.6]
[{"$f":"Langue!F146","v":"Plastique"},0.25,3,0.9]
[]
[null,{"$f":"VLOOKUP(FeldRohrMaterial,Liste_Rohrmaterial,2,FALSE)","v":50},{"$f":"VLOOKUP(FeldRohrMaterial,Liste_Rohrmaterial,3,FALSE)","v":3},{"$f":"VLOOKUP(FeldRohrMaterial,Liste_Rohrmaterial,4,FALSE)","v":0.35}]
[null,{"$f":"VLOOKUP(FeldRohrMaterial_V2,Liste_Rohrmaterial,2,FALSE)","v":50},{"$f":"VLOOKUP(FeldRohrMaterial_V2,Liste_Rohrmaterial,3,FALSE)","v":3},{"$f":"VLOOKUP(FeldRohrMaterial_V2,Liste_Rohrmaterial,4,FALSE)","v":0.35}]
[]
[]
{"$rows_left_out":96}
{"sheet":"Calcul amortissement","index":7,"n_rows":127,"n_cols":7,"rows_kept":127,"cut":false,"hidden":true,"merged":[[25,2,25,3]]}
[null,null,{"$f":"'Bases techniques'!J10","v":"Isolation PIR"},{"$f":"'Bases techniques'!L10","v":"Comparaison"}]
[]
["Grundeingaben"]
["Länge Rohrleitung","[m]",{"$f":"FeldLaengeRohrleitung","v":100},{"$f":"FeldLaengeRohrleitung_V2","v":100}]
["Nutzungsdauer","[a]",{"$f":"ROUND(FeldNutzungszeitAnlage,0)","v":30},{"$f":"ROUND(FeldNutzungszeitAnlage_V2,0)","v":30}]
["Amortisationsdauer","[a]",{"$f":"FeldAmortisationIsolierung","v":1.5},{"$f":"FeldAmortisationIsolierung_V2","v":1.5}]
["Gewinnbringende Zeit","[a]",{"$f":"C5-C6","v":28.5},{"$f":"D5-D6","v":28.5}]
[]
["Jährliche Energiekosten",null,null,null,null,"Einsparungen Nutzenergiebedarf"]
["Wärme-/Kältebedarf (Nutzenergie)","[kWh/a]",{"$f":"IF(FeldMediumstemperatur>FeldUmgebungstemperatur,RWWärmestromRadWBR*FeldLaengeRohrleitung/1000*FeldBetriebszeitTag*30*FeldBetriebszeitJahr,RKWärmestromRadWBR*FeldLaengeRohrleitung/1000*FeldBetriebszeitTag*30*FeldBetriebszeitJahr)","v":6154.2057952880859},{"$f":"IF(FeldMediumstemperatur_V2>FeldUmgebungstemperatur_V2,RWWärmestromRadWBR_V2*FeldLaengeRohrleitung_V2/1000*FeldBetriebszeitTag_V2*30*FeldBetriebszeitJahr_V2,RKWärmestromRadWBR_V2*FeldLaengeRohrleitung_V2/1000*FeldBetriebszeitTag_V2*30*FeldBetriebszeitJahr_V2)","v":7178.5689697265625},null,{"$f":"(D10*D5)-(C10*C5)","v":30730.895233154297},"kWh"]
["Wirkungsgrad","[-]",{"$f":"FeldWirkungsgrad","v":0.85},{"$f":"C11","v":0.85}]
["Endenergiebedarf","[kWh/a]",{"$f":"C10/C11","v":7240.2421121036305},{"$f":"D10/D11","v":8445.3752585018392}]
["Energiepreis","[CHF/kWh]",{"$f":"VLOOKUP(FeldEnergietraeger, 'Autres valeurs'!A99:F103,6,FALSE)","v":0.1},{"$f":"C13","v":0.1}]
["Energiepreissteigerung","[%]",{"$f":"FeldEnergiepreissteigerung","v":1.5},{"$f":"FeldEnergiepreissteigerung_V2","v":1.5}]
["Jährliche Energiekosten","[CHF/a]",{"$f":"C12*C13","v":724.02421121036309},{"$f":"D12*D13","v":844.53752585018401},null,"Einsparungen Energiekosten"]
{"$rows_left_out":113}
{"sheet":"Langue","index":8,"n_rows":339,"n_cols":9,"rows_kept":339,"cut":false,"hidden":true,"merged":[]}
[]
[null,"Auswahl Sprachen","Code"]
[null,"Deutsch",1,"Deutsch"]
[null,"Français",2,"Français"]
[]
[]
[]
[null,null,"Code der gewählten Sprachen.",2]
[]
[]
[null,null,null,null,null,"Texte, welche auch der Oberfläche vorkommen:"]
[]
[null,null,null,null,null,"Text der gewählten sprache","Deutsch","Français"]
[null,null,null,null,null,{"$f":"IF($D$8=$C$3,G14,H14)","v":"Objet"},"Objekt","Objet"]
[null,null,null,null,null,{"$f":"IF($D$8=$C$3,G15,H15)","v":"Nom"},"Name","Nom"]
{"$rows_left_out":325}
{"sheet":"History","index":9,"n_rows":8,"n_cols":4,"rows_kept":8,"cut":false,"hidden":true,"merged":[]}
["Datum","Wer","Was","Umgesetzt"]
["2014-08-06","MM","In der Mappe Anleitung Inhalt in Zelle F53 entfernt, weil Beschluss, dass diese Anleitung vorerst nicht veröfffentlicht wird.\n\"Anleitung zum Rechentoll PIR-RT2 (asuführliche Version)","HSLU :   DH 30.08.14\nVersion PIR_RT2 MM an DH gesandt"]
["2014-08-28","MM","Name Broschüre  „PIR – der Hochleistungswärmedämmstoff“ angepasst d/f  in Mappe Sprache Zeile 280, 282 ","HSLU :   DH 30.08.14\nVersion PIR_RT2 MM an DH gesandt"]
["2014-09-17","MM","ACHTUNG : Version auf 3.1 erhöht / Adressen in Mappe Sprache ergänzt ab Zeile 319. Feld B37 in Mappe Start freigeschaltet (versteckt) / \nDamit kann die Reihenfolge der Adressen in allen Mappen gesteuert werden.  \n1 := Elri / Regisol / swisspor \n2 := Regisol / swisspor / Elri\n3:= swisspor / Elri / Regisol\n","Auf CD verteilt an proPIR am 23.9.2014"]
["2014-09-25","MM","Text Zelle E7 und E11 in Mappe Start werden abgeschnitten. Schriftgrösse in beiden Zellen auf 10 angepasst.\nProjektbenennung im VisualBasic mit RM auf Projekt > Eigenschaften Projektnamen von swisspor_Dämmberechnung auf Rechentool_PIR_RT2 geändert\nSprache Zelle 129 angepasst auf \"Taupunkt, min. Oberflächentemperatur Tauwasserschutz\", \"Point de rosée, température de surface min\" Standartwerte u Kautschuk auf 10'000"]
["2014-10-23","MM","Version auf 3.1b erhöht : \nPrivate Sub MediumsTempBegrenzung() : Z497 über durch unter ersetzt und Z499 plus durch moins ersetzt.\nMsgBox Prompt:=\"Die Mediumstemperatur liegt ausserhalb des Einsatzbreiches eines der gewählten Dämmmaterialien und darf nicht über unter \" + CStr(pMin) + \"°C liegen.\" & Chr(13) & \"Bitte ändern Sie die Mediumstemperatur oder wählen Sie in Variante 2 ein geeignetes Dämmmaterial.\", Title:=\"Hinweis\"\n           ElseIf TBSprache.Range(\"Sprache\").Value = 2 Then\n            MsgBox Prompt:=\"La température du médium se trouve en dehors du domaine d'application du matériau isolant choisi et ne peut pas valoir plus moins de"]
["2014-10-23","MM","In der Adresse der Regisol fehlt bei der Telefon- und Faxnummer nach dem (0) die 32"]
["2014-10-23","MM","rot ergänzt : Jährlicher Energieverlust (an der Rohrleitung)\nEinsparung Energie über eine Nutzungszeit von 30 Jahren (an der Rohrleitung)\nPertes énergétiques annuelles (au tuyau)\nEconomie d'énergie sur une durée d'utilisation de 30 ans (au tuyau)"]

{"sheet":"Tabelle1","index":10,"n_rows":0,"n_cols":0,"rows_kept":0,"cut":false,"hidden":true,"merged":[]}